{"text_format":"1","workbook":"xlsx","n_sheets":11,"sheets":["Intro","Balance Sheet","P & L","Cash Flow","Premium Ratios","Nationwide Premium by LOB","Nationwide Incurred Loss by LOB","Nation Net Prem & Loss Dev LOB","ST","Assumptions","Warning"],"not_rendered":{"charts":0,"images":1,"macros":1,"external_links":0,"defined_names":5,"comments":0,"pivot_tables":0},"unopened":[],"bounds":{"document_bytes":16777216,"sheet_cells":100000,"rows_first":2000,"rows_last":500,"rows_between":2000,"halvings":0,"cell_chars":16384,"cell_head_chars":4096},"cells_cut":0,"cells_raw":0,"read":"whole","date_system":"1900"}

{"sheet":"Intro","index":0,"n_rows":58,"n_cols":20,"rows_kept":58,"cut":false,"hidden":false,"merged":[]}
[null,null,null,null,null,null,null,null,null,null,null,null,false]
[null,null,null,null,null,null,null,null,null,null,null,null,false,"AK","Alaska",{"$f":"IF(TRIM(M2)=\"TRUE\",N2,\"Z\")","v":"Z"},"NC"]
[null,null,null,null,null,null,null,null,null,null,null,null,false,"AL","Alabama",{"$f":"IF(TRIM(M3)=\"TRUE\",N3,\"Z\")","v":"Z"},"PR","Current"]
[null,null,null,"AK","Alaska",null,null,"MT","Montana",null,null,null,false,"AR","Arkansas","Z","TN",null,"Alaska","Go to AK"]
[null,null,null,"AL","Alabama",null,null,"NC","North Carolina",null,null,null,false,"AS","American Samoa","Z","WI",null,"Alabama","Go to AL"]
[null,null,null,"AR","Arkansas",null,null,"ND","North Dakota",null,null,null,false,"AZ","Arizona","Z","Z",null,"Arkansas","Go to AR"]
[null,null,null,"AS","American Samoa",null,null,"NE","Nebraska",null,null,null,false,"CA","California","Z","Z",null,"American Samoa","Go to AS"]
[null,null,null,"AZ","Arizona",null,null,"NH","New Hampshire",null,null,null,false,"CO","Colorado","Z","Z",null,"Arizona","Go to AZ"]
[null,null,null,"CA","California",null,null,"NJ","New Jersey",null,null,null,false,"CT","Connecticut","Z","Z",null,"California","Go to CA"]
[null,null,null,"CO","Colorado",null,null,"NM","New Mexico",null,null,null,false,"DC","District Of Columbia","Z","Z",null,"Colorado","Go to CO"]
[null,null,null,"CT","Connecticut",null,null,"NV","Nevada",null,null,null,false,"DE","Delaware","Z","Z",null,"Connecticut","Go to CT"]
[null,null,null,"DC","District Of Columbia",null,null,"NY","New York",null,null,null,false,"FL","Florida","Z","Z",null,"District Of Columbia","Go to DC"]
[null,null,null,"DE","Delaware",null,null,"OH","Ohio",null,null,null,false,"GA","Georgia","Z","Z",null,"Delaware","Go to DE"]
[null,null,null,"FL","Florida",null,null,"OK","Oklahoma",null,null,null,false,"GU","Guam","Z","Z",null,"Florida","Go to FL"]
[null,null,null,"GA","Georgia",null,null,"OR","Oregon",null,null,null,false,"HI","Hawaii","Z","Z",null,"Georgia","Go to GA"]
{"$rows_left_out":44}
{"sheet":"Balance Sheet","index":1,"n_rows":47,"n_cols":18,"rows_kept":47,"cut":false,"hidden":false,"merged":[[0,7,0,12]]}
[null,null,null,null,"Company Name:",null,null,{"$f":"Intro!B21","v":"Applicant Company Name"}]
[null,null,null,null,"(Property & Casualty Insurance Company)"]
[null,null,null,null,"Pro Forma Statutory Balance Sheet"]
[null,null,null,null,"(In Thousands)"]
[]
[]
[]
[null,null,null,{"$f":"Intro!B23","v":0},null,null,null,null,null,null,{"$f":"Intro!B25","v":1},null,null,null,null,null,null,{"$f":"Intro!B27","v":2}]
["Admitted Assets"]
["-------------------"]
["1.   Bonds"]
["2.  Common Stock"]
["3.  Real Estate/Mortgage Loans"]
["4.  Affiliated Investments"]
["5.  Affiliated Receivables"]
{"$rows_left_out":33}
{"sheet":"P & L","index":2,"n_rows":54,"n_cols":13,"rows_kept":54,"cut":false,"hidden":false,"merged":[[0,7,0,10]]}
[null,null,null,null,null,"Company Name:",null,{"$f":"Intro!B21","v":"Applicant Company Name"}]
[null,null,null,null,null,"(Property & Casualty Insurance Company)"]
[null,null,null,null,null,"Pro Forma Statutory Profit & Loss Statement"]
[null,null,null,null,null,"(In Thousands)"]
[]
[null,null,null,null,{"$f":"Intro!B23","v":0},null,null,null,{"$f":"Intro!B25","v":1},null,null,null,{"$f":"Intro!B27","v":2}]
[]
[null,"1.  Net Premiums Earned",null,null,0]
[null,"2.  Net Losses Incurred (Case & IBNR)",null,null,0]
[null,"3.  Net Loss Adjustment Expenses Incurred",null,null,0]
[null,"4.  Direct and Assumed Commissions & Brokerage",null,null,0]
[null,"5.  Reinsurance Ceding Commissions",null,null,0]
[null,"6.  Net Commissions Incurred (4-5)",null,null,{"$f":"IF(E8=\" \",\" \",E11-E12)","v":0},null,null,null,{"$f":"IF(I8=\" \",\" \",I11-I12)","v":0},null,null,null,{"$f":"IF(M8=\" \",\" \",M11-M12)","v":0}]
[null,"7.  Other Contractual Agreements*",null,null,0,null,null,null,0]
[null,"8.  Other Underwriting Expenses Incurred**",null,null,0]
{"$rows_left_out":40}
{"sheet":"Cash Flow","index":3,"n_rows":32,"n_cols":13,"rows_kept":32,"cut":false,"hidden":false,"merged":[[0,7,0,10]]}
[null,null,null,null,null,"Company Name:",null,{"$f":"Intro!B21","v":"Applicant Company Name"}]
[null,null,null,null,null,"(Property & Casualty Insurance Company)"]
[null,null,null,null,null,"Pro Forma Statutory Cash Flow Statement"]
[null,null,null,null,null,"(In Thousands)"]
[]
[null,null,null,null,{"$f":"Intro!B23","v":0},null,null,null,{"$f":"Intro!B25","v":1},null,null,null,{"$f":"Intro!B27","v":2}]
[null,"Cash From Operations"]
[null,"1.  Premiums Collected Net of Reinsurance"]
[null,"2.  Loss and Loss Adjustments Expenses Paid (Net of S&S)"]
[null,"3.  Underwriting Expenses Paid"]
[null,"4.  Other Underwriting Income(expenses)"]
[null,"5.  Total Cash From Underwriting(1-2-3+4)",null,null,{"$f":"E8-E9-E10+E11","v":0},null,null,null,{"$f":"I8-I9-I10+I11","v":0},null,null,null,{"$f":"M8-M9-M10+M11","v":0}]
[]
[null,"6.  Net Investment Income"]
[null,"7.  Other Income"]
{"$rows_left_out":18}
{"sheet":"Premium Ratios","index":4,"n_rows":19,"n_cols":14,"rows_kept":19,"cut":false,"hidden":false,"merged":[[1,7,1,10]]}
[]
[null,null,null,null,"Company Name:",null,null,{"$f":"Intro!B21","v":"Applicant Company Name"}]
[null,"Nationwide",null,null,"(Property & Casualty Insurance Company)"]
[null,null,null,null,"Premiums Written to Surplus Ratios"]
[null,null,null,null,"Amounts in Whole Dollars"]
[]
["Year","Direct",null,"Assumed ",null,"Gross ",null,"Ceded",null,"Net",null,"Gross",null,"Net"]
[null,"Premiums ",null,"Premiums ",null,"Premiums",null,"Premiums",null,"Premiums ",null,"Written Premiums",null,"Written Premiums"]
[null,"Written",null,"Written",null,"Written",null,"Written",null,"Written",null,"to Surplus",null,"to Surplus"]
[null,"---------",null,"---------",null,"---------",null,"---------",null,"---------",null,"---------",null,"---------"]
[]
[]
[{"$f":"Intro!B23","v":0},{"$f":"+'Nationwide Premium by LOB'!F70","v":0},null,{"$f":"'Nationwide Premium by LOB'!H70","v":0},null,{"$f":"B13+D13","v":0},null,{"$f":"'Nationwide Premium by LOB'!J70","v":0},null,{"$f":"F13-H13","v":0},null,{"$f":"IF('Balance Sheet'!$D$39=0,0,'Premium Ratios'!F13/'Balance Sheet'!$D$39/1000)","v":0},null,{"$f":"IF('Balance Sheet'!$D$39=0,0,'Premium Ratios'!J13/'Balance Sheet'!$D$39/1000)","v":0}]
[]
[]
{"$rows_left_out":5}
{"sheet":"Nationwide Premium by LOB","index":5,"n_rows":216,"n_cols":22,"rows_kept":216,"cut":false,"hidden":false,"merged":[[3,7,3,11],[76,7,76,11],[148,7,148,11]]}
[]
[]
[]
[null,"Nationwide",null,null,"Company Name:",null,null,{"$f":"Intro!$B$21","v":"Applicant Company Name"}]
[null,"Year 1",null,{"$f":"Intro!B23","v":0},"(Property & Casualty Insurance Company)"]
[null,null,null,null,"Planned Premium Volume By Line of Business"]
[null,null,null,null,"Amounts in Whole Dollars"]
[null,null,null,null,null,null,null,null,null,null,null,null,"Mult","Adjusted ","Adjusted "]
[null,"Annual",null,null,null,"Direct",null,"Assumed ",null,"Ceded",null,"Net",null,"Gross","Net","Direct",null,"Assumed",null,"Ceded",null,"Net"]
[null,"Statement",null,null,null,"Premiums ",null,"Premiums ",null,"Premiums",null,"Premiums ",null,null,null,"Premiums",null,"Premiums",null,"Premiums ",null,"Premiums"]
[null,"Line",null,"Description",null,"Written",null,"Written",null,"Written",null,"Written",null,null,null,"Earned",null,"Earned",null,"Earned",null,"Earned"]
[null,"---------",null,"----------------------------------",null,"---------",null,"---------",null,"---------",null,"---------",null,null,null,"---------",null,"---------",null,"---------",null,"---------"]
[null,1,null,"Fire",null,null,null,null,null,null,null,{"$f":"F13+H13-J13","v":0},{"$f":"VLOOKUP(#REF!,#REF!,#REF!,FALSE)","v":{"$error":"#REF!"}},{"$f":"(F13+H13)*M13","v":{"$error":"#REF!"}},{"$f":"L13*M13","v":{"$error":"#REF!"}},null,null,null,null,null,null,{"$f":"P13+R13-T13","v":0}]
[null,2.1,null,"Allied Lines",null,null,null,null,null,null,null,{"$f":"F14+H14-J14","v":0},{"$f":"VLOOKUP(#REF!,#REF!,#REF!,FALSE)","v":{"$error":"#REF!"}},{"$f":"(F14+H14)*M14","v":{"$error":"#REF!"}},{"$f":"L14*M14","v":{"$error":"#REF!"}},null,null,null,null,null,null,{"$f":"P14+R14-T14","v":0}]
[null,2.2000000000000002,null,"Multiple Peril Crop",null,null,null,null,null,null,null,0,{"$f":"VLOOKUP(#REF!,#REF!,#REF!,FALSE)","v":{"$error":"#REF!"}},{"$error":"#REF!"},{"$error":"#REF!"},null,null,null,null,null,null,0]
{"$rows_left_out":202}
{"sheet":"Nationwide Incurred Loss by LOB","index":6,"n_rows":224,"n_cols":12,"rows_kept":224,"cut":false,"hidden":false,"merged":[[4,5,4,8],[79,5,79,8],[153,5,153,8]]}
[]
[]
[]
[]
[null,"Nationwide",null,null,"Company Name:",{"$f":"Intro!$B$21","v":"Applicant Company Name"}]
[null,"Year 1",null,{"$f":"Intro!B23","v":0},"(Property & Casualty Insurance Company)"]
[null,null,null,null,"Incurred Loss Summary By Line of Business"]
[null,null,null,null,"Amounts in Whole Dollars"]
[]
[null,"Annual",null,null,null,"Direct",null,"Assumed ",null,"Ceded",null,"Net"]
[null,"Statement",null,null,null,"Losses ",null,"Losses",null,"Losses",null,"Losses"]
[null,"Line",null,"Description",null,"Incurred*",null,"Incurred*",null,"Incurred*",null,"Incurred*"]
[null,"---------",null,"----------------------------------",null,"---------",null,"---------",null,"---------",null,"---------"]
[null,1,null,"Fire",null,null,null,null,null,null,null,{"$f":"F14+H14-J14","v":0}]
[null,2,null,"Allied Lines",null,null,null,null,null,null,null,{"$f":"F15+H15-J15","v":0}]
{"$rows_left_out":210}
{"sheet":"Nation Net Prem & Loss Dev LOB","index":7,"n_rows":73,"n_cols":22,"rows_kept":73,"cut":false,"hidden":false,"merged":[[2,7,2,12]]}
[]
[]
[null,"Nationwide",null,null,"Company Name:",null,null,{"$f":"Intro!B21","v":"Applicant Company Name"}]
[null,null,null,null,"(Property & Casualty Insurance Company)"]
[null,null,null,null,"Net Premium and Loss Developments By Line of Business",null,null,null,null,null,null,null,null,null,null,null,null,null,""]
[null,null,null,null,"Amounts in Whole Dollars"]
[]
[null,"Annual",null,null,null,null,null,{"$f":"Intro!B23","v":0},null,null,null,null,null,{"$f":"Intro!B25","v":1},null,null,null,null,null,{"$f":"Intro!B27","v":2}]
[null,"Statement",null,null,null,"Premiums ",null,"Losses ",null,"Loss",null,"Premiums ",null,"Losses ",null,"Loss",null,"Premiums ",null,"Losses ",null,"Loss"]
[null,"Line",null,"Description",null,"Earned",null,"Incurred*",null,"Ratio",null,"Earned",null,"Incurred*",null,"Ratio",null,"Earned",null,"Incurred*",null,"Ratio"]
[null,"---------",null,"----------------------------------",null,"---------",null,"---------",null,"---------",null,"---------",null,"---------",null,"---------",null,"---------",null,"---------",null,"---------"]
[null,1,null,"Fire",null,{"$f":"'Nationwide Premium by LOB'!V13","v":0},null,{"$f":"'Nationwide Incurred Loss by LOB'!L14","v":0},null,{"$f":"IF(F12=0,0,H12/F12)","v":0},null,{"$f":"'Nationwide Premium by LOB'!V86","v":0},null,{"$f":"'Nationwide Incurred Loss by LOB'!L89","v":0},null,{"$f":"IF(L12=0,0,N12/L12)","v":0},null,{"$f":"'Nationwide Premium by LOB'!V158","v":0},null,{"$f":"'Nationwide Incurred Loss by LOB'!L163","v":0},null,{"$f":"IF(R12=0,0,T12/R12)","v":0}]
[null,2.1,null,"Allied Lines",null,{"$f":"'Nationwide Premium by LOB'!V14","v":0},null,{"$f":"'Nationwide Incurred Loss by LOB'!L15","v":0},null,{"$f":"IF(F13=0,0,H13/F13)","v":0},null,{"$f":"'Nationwide Premium by LOB'!V87","v":0},null,{"$f":"'Nationwide Incurred Loss by LOB'!L90","v":0},null,{"$f":"IF(L13=0,0,N13/L13)","v":0},null,{"$f":"'Nationwide Premium by LOB'!V159","v":0},null,{"$f":"'Nationwide Incurred Loss by LOB'!L164","v":0},null,{"$f":"IF(R13=0,0,T13/R13)","v":0}]
[null,2.2000000000000002,null,"Multiple Peril Crop",null,{"$f":"'Nationwide Premium by LOB'!V15","v":0},null,{"$f":"'Nationwide Incurred Loss by LOB'!L16","v":0},null,0,null,{"$f":"'Nationwide Premium by LOB'!V88","v":0},null,{"$f":"'Nationwide Incurred Loss by LOB'!L91","v":0},null,0,null,{"$f":"'Nationwide Premium by LOB'!V160","v":0},null,{"$f":"'Nationwide Incurred Loss by LOB'!L165","v":0},null,0]
[null,2.2999999999999998,null,"Federal Flood",null,{"$f":"'Nationwide Premium by LOB'!V16","v":0},null,{"$f":"'Nationwide Incurred Loss by LOB'!L17","v":0},null,0,null,{"$f":"'Nationwide Premium by LOB'!V89","v":0},null,{"$f":"'Nationwide Incurred Loss by LOB'!L92","v":0},null,0,null,{"$f":"'Nationwide Premium by LOB'!V161","v":0},null,{"$f":"'Nationwide Incurred Loss by LOB'!L166","v":0},null,0]
{"$rows_left_out":59}
{"sheet":"ST","index":8,"n_rows":215,"n_cols":75,"rows_kept":215,"cut":false,"hidden":true,"merged":[[145,2,145,4],[145,8,145,13],[0,60,0,65],[73,2,73,4],[73,8,73,13],[2,8,2,13],[0,54,0,56],[2,28,2,30],[2,34,2,36]]}
["State Navigation Menu",null,null,null,null,null,null,null,null,null,null,null,null,null,null,null,null,null,null,null,null,null,null,null,null,null,null,null,null,null,null,null,null,null,null,null,null,null,null,null,null,null,null,null,null,null,null,null,null,null,null,null,null,null,{"$f":"C3","v":"State"},null,null,"Company Name:",null,null,{"$f":"+I3","v":"Applicant Company Name"}]
[null,null,null,null,null,null,null,null,null,null,null,null,null,null,null,null,null,null,null,null,null,null,null,null,null,null,null,null,null,null,null,null,null,null,null,null,null,null,null,null,null,null,null,null,null,null,null,null,null,null,null,null,null,null,null,null,null,"(Property & Casualty Insurance Company)"]
[null,null,"State",null,null,null,"Company Name:",null,{"$f":"Intro!$B$21","v":"Applicant Company Name"},null,null,null,null,null,null,null,null,null,null,null,null,null,null,null,null,null,null,null,{"$f":"C3","v":"State"},null,null,null,"Company Name:",null,{"$f":"Intro!$B$21","v":"Applicant Company Name"},null,null,null,null,null,null,null,null,null,null,null,null,null,null,null,null,null,null,null,null,null,null,"Net Premium and Loss Developments By Line of Business",null,null,null,null,null,null,null,null,null,null,null,null,null,""]
[null,null,"Year 1",null,{"$f":"Intro!B23","v":0},null,"(Property & Casualty Insurance Company)",null,null,null,null,null,null,null,null,null,null,null,null,null,null,null,null,null,null,null,null,null,"Year 1",null,{"$f":"+E4","v":0},null,"(Property & Casualty Insurance Company)",null,null,null,null,null,null,null,null,null,null,null,null,null,null,null,null,null,null,null,null,null,null,null,null,"Amounts in Whole Dollars"]
[null,null,null,null,null,null,"Planned Premium Volume By Line of Business",null,null,null,null,null,null,null,null,null,null,null,null,null,null,null,null,null,null,null,null,null,null,null,null,null,"Incurred Loss Summary By Line of Business "]
[null,null,null,null,null,null,"Amounts in Whole Dollars",null,null,null,null,null,null,null,null,null,null,null,null,null,null,null,null,null,null,null,null,null,null,null,null,null,"Amounts in Whole Dollars",null,null,null,null,null,null,null,null,null,null,null,null,null,null,null,null,null,null,null,null,null,"Annual",null,null,null,null,null,{"$f":"Intro!B23","v":0},null,null,null,null,null,{"$f":"Intro!B25","v":1},null,null,null,null,null,{"$f":"Intro!B27","v":2}]
[null,null,null,null,null,null,null,null,null,null,null,null,null,null,null,null,null,null,null,null,null,null,null,null,null,null,null,null,null,null,null,null,null,null,null,null,null,null,null,null,null,null,null,null,null,null,null,null,null,null,null,null,null,null,"Statement",null,null,null,"Premiums ",null,"Losses ",null,"Loss",null,"Premiums ",null,"Losses ",null,"Loss",null,"Premiums ",null,"Losses ",null,"Loss"]
[null,null,"Annual",null,null,null,"Direct",null,"Assumed ",null,"Ceded",null,"Net",null,"Direct",null,"Assumed",null,"Ceded",null,"Net",null,null,null,null,null,null,null,"Annual",null,null,null,"Direct",null,null,"Assumed ",null,"Ceded",null,"Net",null,null,null,null,null,null,null,null,null,null,null,null,null,null,"Line",null,"Description",null,"Earned",null,"Incurred*",null,"Ratio",null,"Earned",null,"Incurred*",null,"Ratio",null,"Earned",null,"Incurred*",null,"Ratio"]
[null,null,"Statement",null,null,null,"Premiums ",null,"Premiums ",null,"Premiums",null,"Premiums ",null,"Premiums",null,"Premiums",null,"Premiums ",null,"Premiums",null,null,null,null,null,null,null,"Statement",null,null,null,"Losses ",null,null,"Losses",null,"Losses",null,"Losses",null,null,null,null,null,null,null,null,null,null,null,null,null,null,"---------",null,"----------------------------------",null,"---------",null,"---------",null,"---------",null,"---------",null,"---------",null,"---------",null,"---------",null,"---------",null,"---------"]
[null,null,"Line",null,"Description",null,"Written",null,"Written",null,"Written",null,"Written",null,"Earned",null,"Earned",null,"Earned",null,"Earned",null,null,null,null,null,null,null,"Line",null,"Description",null,"Incurred*",null,null,"Incurred*",null,"Incurred*",null,"Incurred*",null,null,null,null,null,null,null,null,null,null,null,null,null,null,1,null,"Fire",null,{"$f":"+U12","v":0},null,{"$f":"AN12","v":0},null,{"$f":"IF(BG10=0,0,BI10/BG10)","v":0},null,{"$f":"U83","v":0},null,{"$f":"AN83","v":0},null,{"$f":"IF(BM10=0,0,BO10/BM10)","v":0},null,{"$f":"U155","v":0},null,{"$f":"AN155","v":0},null,{"$f":"IF(BS10=0,0,BU10/BS10)","v":0}]
[null,null,"---------",null,"----------------------------------",null,"---------",null,"---------",null,"---------",null,"---------",null,"---------",null,"---------",null,"---------",null,"---------",null,null,null,null,null,null,null,"---------",null,"----------------------------------",null,"---------",null,null,"---------",null,"---------",null,"---------",null,null,null,null,null,null,null,null,null,null,null,null,null,null,2.1,null,"Allied Lines",null,0,null,0,null,0,null,0,null,0,null,0,null,0,null,0,null,0]
[null,null,1,null,"Fire",null,null,null,null,null,null,null,{"$f":"G12+I12-K12","v":0},null,null,null,null,null,null,null,{"$f":"O12+Q12-S12","v":0},null,null,null,null,null,null,null,1,null,"Fire",null,null,null,null,null,null,null,null,{"$f":"(AG12+AJ12-AL12)","v":0},null,null,null,null,null,null,null,null,null,null,null,null,null,null,2.2000000000000002,null,"Multiple Peril Crop",null,0,null,0,null,0,null,0,null,0,null,0,null,0,null,0,null,0]
[null,null,2.1,null,"Allied Lines",null,null,null,null,null,null,null,0,null,null,null,null,null,null,null,0,null,null,null,null,null,null,null,2,null,"Allied Lines",null,null,null,null,null,null,null,null,0,null,null,null,null,null,null,null,null,null,null,null,null,null,null,2.2999999999999998,null,"Federal Flood",null,0,null,0,null,0,null,0,null,0,null,0,null,0,null,0,null,0]
[null,null,2.2000000000000002,null,"Multiple Peril Crop",null,null,null,null,null,null,null,0,null,null,null,null,null,null,null,0,null,null,null,null,null,null,null,2.2000000000000002,null,"Multiple Peril Crop",null,null,null,null,null,null,null,null,0,null,null,null,null,null,null,null,null,null,null,null,null,null,null,3,null,"Farmowners Multiple Peril",null,0,null,0,null,0,null,0,null,0,null,0,null,0,null,0,null,0]
[null,null,2.2999999999999998,null,"Federal Flood",null,null,null,null,null,null,null,0,null,null,null,null,null,null,null,0,null,null,null,null,null,null,null,2.2999999999999998,null,"Federal Flood",null,null,null,null,null,null,null,null,0,null,null,null,null,null,null,null,null,null,null,null,null,null,null,4,null,"Homeowners Multiple Peril",null,0,null,0,null,0,null,0,null,0,null,0,null,0,null,0,null,0]
{"$rows_left_out":201}
{"sheet":"Assumptions","index":9,"n_rows":10,"n_cols":1,"rows_kept":10,"cut":false,"hidden":false,"merged":[]}
[]
[]
[]
[]
[]
[]
[]
[]
["List all of the relevant assumptions used to create the proformas.  "]
["Note, assumptions enclosed within the Plan of Operation need not be disclosed again here."]

{"sheet":"Warning","index":10,"n_rows":24,"n_cols":11,"rows_kept":24,"cut":false,"hidden":true,"merged":[[0,0,0,10]]}
["Are you sure you want to delete the selected states?"]
[]
[]
[]
[{"$f":"IF(Intro!M2=TRUE,\"X\",\"\")","v":""},"AK","Alaska",null,{"$f":"IF(Intro!M20=TRUE,\"X\",\"\")","v":""},"KS","Kansas",null,{"$f":"IF(Intro!M39=TRUE,\"X\",\"\")","v":""},"OH","Ohio"]
[{"$f":"IF(Intro!M3=TRUE,\"X\",\"\")","v":""},"AL","Alabama",null,{"$f":"IF(Intro!M21=TRUE,\"X\",\"\")","v":""},"KY","Kentucky",null,{"$f":"IF(Intro!M40=TRUE,\"X\",\"\")","v":""},"OK","Oklahoma"]
[{"$f":"IF(Intro!M4=TRUE,\"X\",\"\")","v":""},"AR","Arkansas",null,{"$f":"IF(Intro!M22=TRUE,\"X\",\"\")","v":""},"LA","Louisiana",null,{"$f":"IF(Intro!M41=TRUE,\"X\",\"\")","v":""},"OR","Oregon"]
[{"$f":"IF(Intro!M5=TRUE,\"X\",\"\")","v":""},"AS","American Samoa",null,{"$f":"IF(Intro!M23=TRUE,\"X\",\"\")","v":""},"MA","Massachusetts",null,{"$f":"IF(Intro!M42=TRUE,\"X\",\"\")","v":""},"PA","Pennsylvania"]
[{"$f":"IF(Intro!M6=TRUE,\"X\",\"\")","v":""},"AZ","Arizona",null,{"$f":"IF(Intro!M24=TRUE,\"X\",\"\")","v":""},"MD","Maryland",null,{"$f":"IF(Intro!M43=TRUE,\"X\",\"\")","v":""},"PR","Puerto Rico"]
[{"$f":"IF(Intro!M7=TRUE,\"X\",\"\")","v":""},"CA","California",null,{"$f":"IF(Intro!M25=TRUE,\"X\",\"\")","v":""},"ME","Maine",null,{"$f":"IF(Intro!M44=TRUE,\"X\",\"\")","v":""},"RI","Rhode Island"]
[{"$f":"IF(Intro!M8=TRUE,\"X\",\"\")","v":""},"CO","Colorado",null,{"$f":"IF(Intro!M26=TRUE,\"X\",\"\")","v":""},"MI","Michigan",null,{"$f":"IF(Intro!M45=TRUE,\"X\",\"\")","v":""},"SC","South Carolina"]
[{"$f":"IF(Intro!M9=TRUE,\"X\",\"\")","v":""},"CT","Connecticut",null,{"$f":"IF(Intro!M27=TRUE,\"X\",\"\")","v":""},"MN","Minnesota",null,{"$f":"IF(Intro!M46=TRUE,\"X\",\"\")","v":""},"SD","South Dakota"]
[{"$f":"IF(Intro!M10=TRUE,\"X\",\"\")","v":""},"DC","District Of Columbia",null,{"$f":"IF(Intro!M28=TRUE,\"X\",\"\")","v":""},"MO","Missouri",null,{"$f":"IF(Intro!M47=TRUE,\"X\",\"\")","v":""},"TN","Tennessee"]
[{"$f":"IF(Intro!M11=TRUE,\"X\",\"\")","v":""},"DE","Delaware",null,{"$f":"IF(Intro!M30=TRUE,\"X\",\"\")","v":""},"MT","Montana",null,{"$f":"IF(Intro!M48=TRUE,\"X\",\"\")","v":""},"TX","Texas"]
[{"$f":"IF(Intro!M12=TRUE,\"X\",\"\")","v":""},"FL","Florida",null,{"$f":"IF(Intro!M31=TRUE,\"X\",\"\")","v":""},"NC","North Carolina",null,{"$f":"IF(Intro!M49=TRUE,\"X\",\"\")","v":""},"UT","Utah"]
{"$rows_left_out":9}